Reaction Details
TargetPhosphodiesterase
LigandBDBM50061902
Substrate/Competitorn/a
Meas. Tech.ChEMBL_156453 (CHEMBL764831)
IC50 90000±n/a nM
Citation Xia, YChackalamannil, SCzarniecki, MTsai, HVaccaro, HCleven, RCook, JFawzi, AWatkins, RZhang, H Synthesis and evaluation of polycyclic pyrazolo[3,4-d]pyrimidines as PDE1 and PDE5 cGMP phosphodiesterase inhibitors. J Med Chem40:4372-7 (1998) 
 
Phosphodiesterase
Name:Phosphodiesterase
Type:PROTEIN
Mol. Mass.:124301.20
Organism:Bos taurus
Description:ChEMBL_156453
Residue:1115
BDBM50061902
NameBDBM50061902
Synonyms:(R)-3-Benzyl-7-isopropyl-2,5-dimethyl-7,8-dihydro-2H,5H-1,2,5,6,8a-pentaaza-as-indacen-4-one | CHEMBL140185
TypeSmall organic molecule
Emp. Form.C19H23N5O
Mol. Mass.337.4188
SMILESCC(C)[C@@H]1CN2C(=N1)N(C)C(=O)c1c2nn(C)c1Cc1ccccc1