Reaction Details
TargetPlatelet-activating factor receptor
LigandBDBM50048485
Substrate/Competitorn/a
Meas. Tech.ChEMBL_158348 (CHEMBL768492)
Ki 0.400000±n/a nM
Citation Curtin, MLDavidsen, SKHeyman, HRGarland, RBSheppard, GSFlorjancic, ASXu, LCarrera, GMSteinman, DHTrautmann, JAAlbert, DHMagoc, TJTapang, PRhein, DAConway, RGLuo, GDenissen, JFMarsh, KCMorgan, DWSummers, JB Discovery and evaluation of a series of 3-acylindole imidazopyridine platelet-activating factor antagonists. J Med Chem41:74-95 (1998) 
 
Platelet-activating factor receptor
Name:Platelet-activating factor receptor
Type:Protein
Mol. Mass.:39005.63
Organism:Cavia porcellus
Description:n/a
Residue:342
BDBM50048485
NameBDBM50048485
Synonyms:(S)-4-Methyl-2-{methyl-[4-(2-methyl-imidazo[4,5-c]pyridin-1-ylmethyl)-benzenesulfonyl]-amino}-pentanoic acid ethyl ester BB-882 Lexipafant
TypeSmall organic molecule
Emp. Form.C23H30N4O4S
Mol. Mass.458.574
SMILESCCOC(=O)[C@H](CC(C)C)N(C)S(=O)(=O)c1ccc(Cn2c(C)nc3cnccc23)cc1