Reaction Details
TargetPlatelet-activating factor receptor
LigandBDBM50062095
Substrate/Competitorn/a
Meas. Tech.ChEMBL_158347 (CHEMBL768491)
Ki 2±n/a nM
Citation Curtin, MLDavidsen, SKHeyman, HRGarland, RBSheppard, GSFlorjancic, ASXu, LCarrera, GMSteinman, DHTrautmann, JAAlbert, DHMagoc, TJTapang, PRhein, DAConway, RGLuo, GDenissen, JFMarsh, KCMorgan, DWSummers, JB Discovery and evaluation of a series of 3-acylindole imidazopyridine platelet-activating factor antagonists. J Med Chem41:74-95 (1998) 
 
Platelet-activating factor receptor
Name:Platelet-activating factor receptor
Type:Protein
Mol. Mass.:39005.63
Organism:Cavia porcellus
Description:n/a
Residue:342
BDBM50062095
NameBDBM50062095
Synonyms:4-Methyl-3-{2-[4-(2-methyl-imidazo[4,5-c]pyridin-1-yl)-piperidin-1-yl]-acetyl}-indole-1-carboxylic acid dimethylamide | CHEMBL172484
TypeSmall organic molecule
Emp. Form.C26H30N6O2
Mol. Mass.458.5554
SMILESCN(C)C(=O)n1cc(C(=O)CN2CCC(CC2)n2c(C)nc3cnccc23)c2c(C)cccc12