Reaction Details
TargetPlatelet-activating factor receptor
LigandBDBM50062098
Substrate/Competitorn/a
Meas. Tech.ChEMBL_158347 (CHEMBL768491)
Ki 0.950000±n/a nM
Citation Curtin, MLDavidsen, SKHeyman, HRGarland, RBSheppard, GSFlorjancic, ASXu, LCarrera, GMSteinman, DHTrautmann, JAAlbert, DHMagoc, TJTapang, PRhein, DAConway, RGLuo, GDenissen, JFMarsh, KCMorgan, DWSummers, JB Discovery and evaluation of a series of 3-acylindole imidazopyridine platelet-activating factor antagonists. J Med Chem41:74-95 (1998) 
 
Platelet-activating factor receptor
Name:Platelet-activating factor receptor
Type:Protein
Mol. Mass.:39005.63
Organism:Cavia porcellus
Description:n/a
Residue:342
BDBM50062098
NameBDBM50062098
Synonyms:1-Dimethylcarbamoyl-3-[4-(2-methyl-imidazo[4,5-c]pyridin-1-ylmethyl)-benzoyl]-6-phenylethynyl-1H-indole-4-carboxylic acid methyl ester | CHEMBL367922
TypeSmall organic molecule
Emp. Form.C36H29N5O4
Mol. Mass.595.6466
SMILESCOC(=O)c1cc(cc2n(cc(C(=O)c3ccc(Cn4c(C)nc5cnccc45)cc3)c12)C(=O)N(C)C)C#Cc1ccccc1