Reaction Details
TargetMuscarinic acetylcholine receptor M1
LigandBDBM50004665
Substrate/Competitorn/a
Meas. Tech.ChEMBL_139212 (CHEMBL745687)
IC50 9000±n/a nM
Citation Sauerberg, POlesen, PHSheardown, MJRimvall, KThøgersen, HShannon, HESawyer, BDWard, JSBymaster, FPDeLapp, NWCalligaro, DOSwedberg, MD Conformationally constrained analogues of the muscarinic agonist 3-(4-(methylthio)-1,2,5-thiadiazol-3-yl)-1,2,5,6-tetrahydro-1-methylpyr idine. Synthesis, receptor affinity, and antinociceptive activity. J Med Chem41:109-16 (1998) 
 
Muscarinic acetylcholine receptor M1
Name:Muscarinic acetylcholine receptor M1
Type:Protein
Mol. Mass.:51442.54
Organism:Homo sapiens (Human)
Description:P11229
Residue:460
BDBM50004665
NameBDBM50004665
Synonyms:(oxotremorine)1-(4-Pyrrolidin-1-yl-but-2-ynyl)-pyrrolidin-2-one 1-(4-Pyrrolidin-1-yl-but-2-ynyl)-pyrrolidin-2-one (oxotremorphine) 1-[4-(2-oxo-pyrrolidin-1-yl)-but-2-ynyl]-pyrrolidinium Oxotremorine cid_4630
TypeSmall organic molecule
Emp. Form.C12H18N2O
Mol. Mass.206.2841
SMILESO=C1CCCN1CC#CCN1CCCC1