Reaction Details
TargetMuscarinic acetylcholine receptor M5
LigandBDBM50004665
Substrate/Competitorn/a
Meas. Tech.ChEMBL_139520 (CHEMBL748276)
IC50 8000±n/a nM
Citation Sauerberg, POlesen, PHSheardown, MJRimvall, KThøgersen, HShannon, HESawyer, BDWard, JSBymaster, FPDeLapp, NWCalligaro, DOSwedberg, MD Conformationally constrained analogues of the muscarinic agonist 3-(4-(methylthio)-1,2,5-thiadiazol-3-yl)-1,2,5,6-tetrahydro-1-methylpyr idine. Synthesis, receptor affinity, and antinociceptive activity. J Med Chem41:109-16 (1998) 
 
Muscarinic acetylcholine receptor M5
Name:Muscarinic acetylcholine receptor M5
Type:PROTEIN
Mol. Mass.:60102.35
Organism:Homo sapiens (Human)
Description:ChEMBL_1517990
Residue:532
BDBM50004665
NameBDBM50004665
Synonyms:(oxotremorine)1-(4-Pyrrolidin-1-yl-but-2-ynyl)-pyrrolidin-2-one 1-(4-Pyrrolidin-1-yl-but-2-ynyl)-pyrrolidin-2-one (oxotremorphine) 1-[4-(2-oxo-pyrrolidin-1-yl)-but-2-ynyl]-pyrrolidinium Oxotremorine cid_4630
TypeSmall organic molecule
Emp. Form.C12H18N2O
Mol. Mass.206.2841
SMILESO=C1CCCN1CC#CCN1CCCC1