Reaction Details
TargetMatrix metalloproteinase-9
LigandBDBM50062318
Substrate/Competitorn/a
Meas. Tech.ChEMBL_105401 (CHEMBL710820)
Ki 0.630000±n/a nM
Citation Levy, DELapierre, FLiang, WYe, WLange, CWLi, XGrobelny, DCasabonne, MTyrrell, DHolme, KNadzan, AGalardy, RE Matrix metalloproteinase inhibitors: a structure-activity study. J Med Chem41:199-223 (1998) 
 
Matrix metalloproteinase-9
Name:Matrix metalloproteinase-9
Type:Enzyme
Mol. Mass.:78452.28
Organism:Homo sapiens (Human)
Description:P14780
Residue:707
BDBM50062318
NameBDBM50062318
Synonyms:(R)-N*4*-Hydroxy-N*1*-[(S)-2-(1H-indol-3-yl)-1-methylcarbamoyl-ethyl]-2-octyl-succinamide | CHEMBL306189
TypeSmall organic molecule
Emp. Form.C24H36N4O4
Mol. Mass.444.567
SMILESCCCCCCCC[C@H](CC(=O)NO)C(=O)N[C@@H](Cc1c[nH]c2ccccc12)C(=O)NC