Reaction Details
Target72 kDa type IV collagenase
LigandBDBM50062342
Substrate/Competitorn/a
Meas. Tech.ChEMBL_104542 (CHEMBL718929)
Ki 0.42±n/a nM
Citation Levy, DELapierre, FLiang, WYe, WLange, CWLi, XGrobelny, DCasabonne, MTyrrell, DHolme, KNadzan, AGalardy, RE Matrix metalloproteinase inhibitors: a structure-activity study. J Med Chem41:199-223 (1998) 
 
72 kDa type IV collagenase
Name:72 kDa type IV collagenase
Type:Enzyme
Mol. Mass.:73870.36
Organism:Homo sapiens (Human)
Description: P08253
Residue:660
BDBM50062342
NameBDBM50062342
Synonyms:(R)-N*4*-Hydroxy-2-isobutyl-N*1*-((R)-1-methylcarbamoyl-2-naphthalen-1-yl-ethyl)-succinamide | CHEMBL70492
TypeSmall organic molecule
Emp. Form.C22H29N3O4
Mol. Mass.399.4834
SMILESCNC(=O)[C@@H](Cc1cccc2ccccc12)NC(=O)[C@H](CC(C)C)CC(=O)NO