Reaction Details
Target72 kDa type IV collagenase
LigandBDBM50062293
Substrate/Competitorn/a
Meas. Tech.ChEMBL_104542 (CHEMBL718929)
Ki 0.44±n/a nM
Citation Levy, DELapierre, FLiang, WYe, WLange, CWLi, XGrobelny, DCasabonne, MTyrrell, DHolme, KNadzan, AGalardy, RE Matrix metalloproteinase inhibitors: a structure-activity study. J Med Chem41:199-223 (1998) 
 
72 kDa type IV collagenase
Name:72 kDa type IV collagenase
Type:Enzyme
Mol. Mass.:73870.36
Organism:Homo sapiens (Human)
Description: P08253
Residue:660
BDBM50062293
NameBDBM50062293
Synonyms:(R)-N*4*-Hydroxy-N*1*-[(S)-1-(2-hydroxy-ethylcarbamoyl)-2-(1H-indol-3-yl)-ethyl]-2-isobutyl-succinamide | CHEMBL420932
TypeSmall organic molecule
Emp. Form.C21H30N4O5
Mol. Mass.418.4867
SMILESCC(C)C[C@H](CC(=O)NO)C(=O)N[C@@H](Cc1c[nH]c2ccccc12)C(=O)NCCO