Reaction Details
TargetNeutrophil collagenase
LigandBDBM50062356
Substrate/Competitorn/a
Meas. Tech.ChEMBL_105205 (CHEMBL713844)
Ki 0.7±n/a nM
Citation Levy, DELapierre, FLiang, WYe, WLange, CWLi, XGrobelny, DCasabonne, MTyrrell, DHolme, KNadzan, AGalardy, RE Matrix metalloproteinase inhibitors: a structure-activity study. J Med Chem41:199-223 (1998) 
 
Neutrophil collagenase
Name:Neutrophil collagenase
Type:Enzyme
Mol. Mass.:53413.48
Organism:Homo sapiens (Human)
Description:P22894
Residue:467
BDBM50062356
NameBDBM50062356
Synonyms:(R)-N*4*-Hydroxy-2-isobutyl-N*1*-[(R)-1-((S)-1-phenyl-ethylcarbamoyl)-2-pyridin-4-yl-ethyl]-succinamide | CHEMBL308228
TypeSmall organic molecule
Emp. Form.C24H32N4O4
Mol. Mass.440.5353
SMILESCC(C)C[C@H](CC(=O)NO)C(=O)N[C@H](Cc1ccncc1)C(=O)N[C@@H](C)c1ccccc1