Reaction Details
TargetMitogen-activated protein kinase 14
LigandBDBM50313107
Substrate/Competitorn/a
Meas. Tech.ChEMBL_1837226 (CHEMBL4337359)
Ki 1.000000±n/a nM
Citation Astolfi, AKudolo, MBrea, JManni, GManfroni, GPalazzotti, DSabatini, SCecchetti, FFelicetti, TCannalire, RMassari, STabarrini, OLoza, MIFallarino, FCecchetti, VLaufer, SABarreca, ML Discovery of potent p38? MAPK inhibitors through a funnel like workflow combining in silico screening and in vitro validation. Eur J Med Chem182:0 (2019) 
 
Mitogen-activated protein kinase 14
Name:Mitogen-activated protein kinase 14
Type:Serine/threonine-protein kinase
Mol. Mass.:41286.76
Organism:Homo sapiens (Human)
Description:Q16539
Residue:360
BDBM50313107
NameBDBM50313107
Synonyms:4-chloro-N-cyclopropyl-3-(1-(2,6-difluorophenyl)-1H-pyrazolo[4,3-d]pyridazin-4-ylamino)benzamide CHEMBL1082158
TypeSmall organic molecule
Emp. Form.C21H15ClF2N6O
Mol. Mass.440.833
SMILESFc1cccc(F)c1-n1ncc2c(Nc3cc(ccc3Cl)C(=O)NC3CC3)nncc12