Reaction Details
TargetCannabinoid receptor 1
LigandBDBM50063882
Substrate/Competitorn/a
Meas. Tech.ChEMBL_46813 (CHEMBL659699)
Ki 0.65±n/a nM
Citation Papahatjis, DPKourouli, TAbadji, VGoutopoulos, AMakriyannis, A Pharmacophoric requirements for cannabinoid side chains: multiple bond and C1'-substituted delta 8-tetrahydrocannabinols. J Med Chem41:1195-200 (1998) 
 
Cannabinoid receptor 1
Name:Cannabinoid receptor 1
Type:G Protein-Coupled Receptor (GPCR)
Mol. Mass.:52856.55
Organism:Rattus norvegicus (rat)
Description:P20272
Residue:473
BDBM50063882
NameBDBM50063882
Synonyms:(6aR,10aR)-3-(hept-1-ynyl)-6,6,9-trimethyl-6a,7,10,10a-tetrahydro-6H-benzo[c]chromen-1-ol CHEMBL279147
TypeSmall organic molecule
Emp. Form.C23H30O2
Mol. Mass.338.4831
SMILESCCCCCC#Cc1cc(O)c2[C@@H]3CC(C)=CC[C@H]3C(C)(C)Oc2c1