Reaction Details
TargetHistamine H1 receptor
LigandBDBM50509922
Substrate/Competitorn/a
Meas. Tech.ChEMBL_1839745 (CHEMBL4339960)
Ki 3.6±n/a nM
Citation Dou, FCao, XJing, PWu, CZhang, YChen, YZhang, G Synthesis and evaluation of histamine H Bioorg Med Chem Lett29:1492-1496 (2019) 
 
Histamine H1 receptor
Name:Histamine H1 receptor
Type:G Protein-Coupled Receptor (GPCR)
Mol. Mass.:55641.53
Organism:Cavia porcellus (domestic guinea pig)
Description:Guinea pig cerebellum was used in binding assay.
Residue:488
BDBM50509922
NameBDBM50509922
Synonyms:CHEMBL4575319
TypeSmall organic molecule
Emp. Form.C17H24N2O2
Mol. Mass.288.3847
SMILES[H][C@@]12CCC[C@]1([H])CN(CCCOc1ccc(cc1)C(N)=O)C2