Reaction Details
TargetDihydrofolate reductase
LigandBDBM18268
Substrate/Competitorn/a
Meas. Tech.ChEMBL_55132 (CHEMBL668777)
IC50 3±n/a nM
Citation Gangjee, AElzein, EQueener, SFMcGuire, JJ Synthesis and biological activities of tricyclic conformationally restricted tetrahydropyrido annulated furo[2,3-d]pyrimidines as inhibitors of dihydrofolate reductases. J Med Chem41:1409-16 (1998) 
 
Dihydrofolate reductase
Name:Dihydrofolate reductase
Type:Enzyme
Mol. Mass.:21638.84
Organism:Rattus norvegicus (rat)
Description:n/a
Residue:187
BDBM18268
NameBDBM18268
Synonyms:5-methyl-6-{[(3,4,5-trimethoxyphenyl)amino]methyl}quinazoline-2,4-diamine TMQ US11111252, Compound TMQ | US11530198, Example Trimetrexate
TypeSmall organic molecule
Emp. Form.C19H23N5O3
Mol. Mass.369.4176
SMILESCOc1cc(NCc2ccc3nc(N)nc(N)c3c2C)cc(OC)c1OC