Reaction Details
TargetD(2) dopamine receptor
LigandBDBM50064172
Substrate/Competitorn/a
Meas. Tech.ChEMBL_62573 (CHEMBL671504)
Ki 10400±n/a nM
Citation Quaglia, WGiannella, MPiergentili, APigini, MBrasili, LDi Toro, RRossetti, LSpampinato, SMelchiorre, C 1'-Benzyl-3,4-dihydrospiro[2H-1- benzothiopyran-2,4'-piperidine] (spipethiane), a potent and highly selective sigma1 ligand. J Med Chem41:1557-60 (1998) 
 
D(2) dopamine receptor
Name:D(2) dopamine receptor
Type:G Protein-Coupled Receptor (GPCR)
Mol. Mass.:50931.60
Organism:Rattus norvegicus (rat)
Description:P61169
Residue:444
BDBM50064172
NameBDBM50064172
Synonyms:1-benzylspiro[hexahydropyridine-4,2'-(3',4'-dihydro-2'H-thiochromene)] SPIPETHIANE
TypeSmall organic molecule
Emp. Form.C20H23NS
Mol. Mass.309.468
SMILESC(N1CCC2(CC1)CCc1ccccc1S2)c1ccccc1