Reaction Details
TargetMuscarinic acetylcholine receptor M2
LigandBDBM50036764
Substrate/Competitorn/a
Meas. Tech.ChEMBL_140190 (CHEMBL744907)
Ki 2700±n/a nM
Citation Quaglia, WGiannella, MPiergentili, APigini, MBrasili, LDi Toro, RRossetti, LSpampinato, SMelchiorre, C 1'-Benzyl-3,4-dihydrospiro[2H-1- benzothiopyran-2,4'-piperidine] (spipethiane), a potent and highly selective sigma1 ligand. J Med Chem41:1557-60 (1998) 
 
Muscarinic acetylcholine receptor M2
Name:Muscarinic acetylcholine receptor M2
Type:Enzyme Catalytic Domain
Mol. Mass.:51555.53
Organism:RAT
Description:P10980
Residue:466
BDBM50036764
NameBDBM50036764
Synonyms:1'-benzylspiro[1,2,3,4-tetrahydronaphthalene-2,4'-(hexahydropyridine)]-1-one; hydrochloride CHEMBL554874
TypeSmall organic molecule
Emp. Form.C21H23NO
Mol. Mass.305.4134
SMILESO=C1c2ccccc2CCC11CCN(Cc2ccccc2)CC1