Reaction Details
TargetLysosomal Pro-X carboxypeptidase
LigandBDBM50044426
Substrate/Competitorn/a
Meas. Tech.ChEMBL_154091 (CHEMBL873407)
Ki 16±n/a nM
Citation Quaglia, WGiannella, MPiergentili, APigini, MBrasili, LDi Toro, RRossetti, LSpampinato, SMelchiorre, C 1'-Benzyl-3,4-dihydrospiro[2H-1- benzothiopyran-2,4'-piperidine] (spipethiane), a potent and highly selective sigma1 ligand. J Med Chem41:1557-60 (1998) 
 
Lysosomal Pro-X carboxypeptidase
Name:Lysosomal Pro-X carboxypeptidase
Type:Enzyme
Mol. Mass.:55805.19
Organism:Homo sapiens (Human)
Description:P42785
Residue:496
BDBM50044426
NameBDBM50044426
Synonyms:1-[1-(3-Isothiocyanato-phenyl)-cyclohexyl]-piperidine | CHEMBL41541
TypeSmall organic molecule
Emp. Form.C18H24N2S
Mol. Mass.300.462
SMILESS=C=Nc1cccc(c1)C1(CCCCC1)N1CCCCC1