Reaction Details
TargetMuscarinic acetylcholine receptor M3
LigandBDBM50064176
Substrate/Competitorn/a
Meas. Tech.ChEMBL_138962 (CHEMBL742774)
Ki 998.0±n/a nM
Citation Quaglia, WGiannella, MPiergentili, APigini, MBrasili, LDi Toro, RRossetti, LSpampinato, SMelchiorre, C 1'-Benzyl-3,4-dihydrospiro[2H-1- benzothiopyran-2,4'-piperidine] (spipethiane), a potent and highly selective sigma1 ligand. J Med Chem41:1557-60 (1998) 
 
Muscarinic acetylcholine receptor M3
Name:Muscarinic acetylcholine receptor M3
Type:Enzyme Catalytic Domain
Mol. Mass.:66086.66
Organism:RAT
Description:Cholinergic, muscarinic M3 CHRM3 RAT::P08483
Residue:589
BDBM50064176
NameBDBM50064176
Synonyms:CHEMBL27673 METHOCTRAMINE N1,N8-bis(6-(2-methoxybenzylamino)hexyl)octane-1,8-diamine
TypeSmall organic molecule
Emp. Form.C36H62N4O2
Mol. Mass.582.9031
SMILESCOc1ccccc1CNCCCCCCNCCCCCCCCNCCCCCCNCc1ccccc1OC