Reaction Details
TargetBeta-2 adrenergic receptor
LigandBDBM50064207
Substrate/Competitorn/a
Meas. Tech.ChEMBL_38607 (CHEMBL652290)
IC50>10000±n/a nM
Citation Blanc, MTamir, AAubriot, SMichel, MCBouzoubaa, MLeclerc, GDemenge, P Synthesis and adrenergic activity of a new series of N-aryl dicyclopropyl ketone oxime ethers: SAR and stereochemical aspects. J Med Chem41:1613-8 (1998) 
 
Beta-2 adrenergic receptor
Name:Beta-2 adrenergic receptor
Type:PROTEIN
Mol. Mass.:46593.67
Organism:Canis familiaris
Description:ChEMBL_56504
Residue:415
BDBM50064207
NameBDBM50064207
Synonyms:CHEMBL40217 | Dicyclopropyl-methanone O-(2-hydroxy-3-p-tolylamino-propyl)-oxime
TypeSmall organic molecule
Emp. Form.C17H24N2O2
Mol. Mass.288.3847
SMILESCc1ccc(NCC(O)CON=C(C2CC2)C2CC2)cc1