Reaction Details
TargetRetinoic acid receptor gamma
LigandBDBM31883
Substrate/Competitorn/a
Meas. Tech.ChEMBL_196165 (CHEMBL804938)
IC50 4±n/a nM
Citation Muccio, DDBrouillette, WJBreitman, TRTaimi, MEmanuel, PDZhang, XChen, GSani, BPVenepally, PReddy, LAlam, MSimpson-Herren, LHill, DL Conformationally defined retinoic acid analogues. 4. Potential new agents for acute promyelocytic and juvenile myelomonocytic leukemias. J Med Chem41:1679-87 (1998) 
 
Retinoic acid receptor gamma
Name:Retinoic acid receptor gamma
Type:PROTEIN
Mol. Mass.:50896.02
Organism:Mus musculus
Description:ChEMBL_196161
Residue:458
BDBM31883
NameBDBM31883
Synonyms:9-cis-retinoic acid (9cRA) AT-RA CHEMBL38 SMR000058245 Vitamin A acid [3H]Retinoic acid [3H]tretinoin cid_444795
Typeradiolabeled ligand
Emp. Form.C20H28O2
Mol. Mass.300.4351
SMILESC\C(\C=C\C1=C(C)CCCC1(C)C)=C/C=C/C(/C)=C/C(O)=O