Reaction Details
TargetAlcohol dehydrogenase 1C
LigandBDBM50064280
Substrate/Competitorn/a
Meas. Tech.ChEMBL_31170 (CHEMBL641135)
Ki 13000±n/a nM
Citation Schindler, JFBerst, KBPlapp, BV Inhibition of human alcohol dehydrogenases by formamides. J Med Chem41:1696-701 (1998) 
 
Alcohol dehydrogenase 1C
Name:Alcohol dehydrogenase 1C
Type:PROTEIN
Mol. Mass.:39877.25
Organism:Homo sapiens (Human)
Description:ChEMBL_31170
Residue:375
BDBM50064280
NameBDBM50064280
Synonyms:CHEMBL295789 | N-Cyclopentyl-formamide
TypeSmall organic molecule
Emp. Form.C6H11NO
Mol. Mass.113.1576
SMILESO=CNC1CCCC1