Reaction Details
TargetAll-trans-retinol dehydrogenase [NAD(+)] ADH7
LigandBDBM50064266
Substrate/Competitorn/a
Meas. Tech.ChEMBL_31173 (CHEMBL641138)
Ki 740±n/a nM
Citation Schindler, JFBerst, KBPlapp, BV Inhibition of human alcohol dehydrogenases by formamides. J Med Chem41:1696-701 (1998) 
 
All-trans-retinol dehydrogenase [NAD(+)] ADH7
Name:All-trans-retinol dehydrogenase [NAD(+)] ADH7
Type:PROTEIN
Mol. Mass.:41487.40
Organism:Homo sapiens (Human)
Description:ChEMBL_31175
Residue:386
BDBM50064266
NameBDBM50064266
Synonyms:CHEMBL43719 N-Heptyl-formamide
TypeSmall organic molecule
Emp. Form.C8H17NO
Mol. Mass.143.2267
SMILESCCCCCCCNC=O