Reaction Details
TargetAlcohol dehydrogenase 1A
LigandBDBM50064267
Substrate/Competitorn/a
Meas. Tech.ChEMBL_31168 (CHEMBL646633)
Ki 1800±n/a nM
Citation Schindler, JFBerst, KBPlapp, BV Inhibition of human alcohol dehydrogenases by formamides. J Med Chem41:1696-701 (1998) 
 
Alcohol dehydrogenase 1A
Name:Alcohol dehydrogenase 1A
Type:PROTEIN
Mol. Mass.:39866.36
Organism:Homo sapiens (Human)
Description:ChEMBL_31168
Residue:375
BDBM50064267
NameBDBM50064267
Synonyms:CHEMBL297125 | N,N-Dicyclobutyl-formamide
TypeSmall organic molecule
Emp. Form.C9H15NO
Mol. Mass.153.2215
SMILESO=CN(C1CCC1)C1CCC1