Reaction Details
TargetAlcohol dehydrogenase 1C
LigandBDBM50064278
Substrate/Competitorn/a
Meas. Tech.ChEMBL_31170 (CHEMBL641135)
Ki 5200±n/a nM
Citation Schindler, JFBerst, KBPlapp, BV Inhibition of human alcohol dehydrogenases by formamides. J Med Chem41:1696-701 (1998) 
 
Alcohol dehydrogenase 1C
Name:Alcohol dehydrogenase 1C
Type:PROTEIN
Mol. Mass.:39877.25
Organism:Homo sapiens (Human)
Description:ChEMBL_31170
Residue:375
BDBM50064278
NameBDBM50064278
Synonyms:CHEMBL46778 N-Zyklohexylformamid formamidocyclohexane
TypeSmall organic molecule
Emp. Form.C7H13NO
Mol. Mass.127.1842
SMILESO=CNC1CCCCC1