Reaction Details
TargetNeutrophil elastase
LigandBDBM50064309
Substrate/Competitorn/a
Meas. Tech.ChEMBL_63486 (CHEMBL674777)
Ki 133±n/a nM
KOFF 0.0000292 s-1
KON 219 M-1s-1
Citation Gütschow, MNeumann, U Novel thieno[2,3-d][1,3]oxazin-4-ones as inhibitors of human leukocyte elastase. J Med Chem41:1729-40 (1998) 
 
Neutrophil elastase
Name:Neutrophil elastase
Type:Enzyme
Mol. Mass.:28532.38
Organism:Homo sapiens (Human)
Description:P08246
Residue:267
BDBM50064309
NameBDBM50064309
Synonyms:2-Isobutoxy-5,6-dimethyl-thieno[2,3-d][1,3]oxazin-4-one | CHEMBL50667
TypeSmall organic molecule
Emp. Form.C12H15NO3S
Mol. Mass.253.317
SMILESCC(C)COc1nc2sc(C)c(C)c2c(=O)o1