Reaction Details
TargetStromelysin-1
LigandBDBM50064340
Substrate/Competitorn/a
Meas. Tech.ChEMBL_104745 (CHEMBL710745)
Ki 1.93±n/a nM
Citation Xue, CBHe, XRoderick, JDeGrado, WFCherney, RJHardman, KDNelson, DJCopeland, RAJaffee, BDDecicco, CP Design and synthesis of cyclic inhibitors of matrix metalloproteinases and TNF-alpha production. J Med Chem41:1745-8 (1998) 
 
Stromelysin-1
Name:Stromelysin-1
Type:Enzyme
Mol. Mass.:53973.13
Organism:Homo sapiens (Human)
Description: P08254
Residue:477
BDBM50064340
NameBDBM50064340
Synonyms:(2R,3S)-N*4*-Hydroxy-2-isobutyl-N*1*-[(R)-2-(4-methoxy-phenyl)-1-methylcarbamoyl-ethyl]-3-methyl-succinamide BB-16 N*4*-Hydroxy-2-isobutyl-N*1*-[2-(4-methoxy-phenyl)-1-methylcarbamoyl-ethyl]-3-methyl-succinamide
TypeSmall organic molecule
Emp. Form.C20H31N3O5
Mol. Mass.393.4772
SMILESCNC(=O)[C@@H](Cc1ccc(OC)cc1)NC(=O)[C@H](CC(C)C)[C@H](C)C(=O)NO