Reaction Details
TargetPotassium voltage-gated channel subfamily H member 2
LigandBDBM50364777
Substrate/Competitorn/a
Meas. Tech.ChEMBL_1840679 (CHEMBL4340978)
IC50 2100±n/a nM
Citation Martínez-González, SRodríguez-Arístegui, SGómez de la Oliva, CAHernández, AIGonzález Cantalapiedra, EVarela, CGarcía, ABRabal, OOyarzabal, JBischoff, JRKlett, JAlbarrán, MICebriá, AAjenjo, NGarcía-Serelde, BGómez-Casero, ECuadrado-Urbano, MCebrián, DBlanco-Aparicio, CPastor, J Discovery of novel triazolo[4,3-b]pyridazin-3-yl-quinoline derivatives as PIM inhibitors. Eur J Med Chem168:87-109 (2019) 
 
Potassium voltage-gated channel subfamily H member 2
Name:Potassium voltage-gated channel subfamily H member 2
Type:Multi-pass membrane protein
Mol. Mass.:126672.65
Organism:Homo sapiens (Human)
Description:Q12809
Residue:1159
BDBM50364777
NameBDBM50364777
Synonyms:CHEMBL1952142
TypeSmall organic molecule
Emp. Form.C19H21F3N6O2
Mol. Mass.422.4042
SMILESCOc1cc(NCC2CCNCC2)nc2n(nnc12)-c1cccc(OC(F)(F)F)c1