Reaction Details
TargetOxytocin receptor
LigandBDBM50064722
Substrate/Competitorn/a
Meas. Tech.ChEMBL_149043 (CHEMBL762236)
Ki 3.5±n/a nM
Citation Bell, IMErb, JMFreidinger, RMGallicchio, SNGuare, JPGuidotti, MTHalpin, RAHobbs, DWHomnick, CFKuo, MSLis, EVMathre, DJMichelson, SRPawluczyk, JMPettibone, DJReiss, DRVickers, SWilliams, PDWoyden, CJ Development of orally active oxytocin antagonists: studies on 1-(1-[4-[1-(2-methyl-1-oxidopyridin-3-ylmethyl)piperidin-4-yloxy]-2- methoxybenzoyl]piperidin-4-yl)-1,4-dihydrobenz[d][1,3]oxazin-2-one (L-372,662) and related pyridines. J Med Chem41:2146-63 (1998) 
 
Oxytocin receptor
Name:Oxytocin receptor
Type:Enzyme Catalytic Domain
Mol. Mass.:42793.26
Organism:Homo sapiens (Human)
Description:Oxytocin OXTR HEK293::B2R9L7
Residue:389
BDBM50064722
NameBDBM50064722
Synonyms:1-(1-{2-Methoxy-4-[1-(4-methyl-1-oxy-pyridin-3-ylmethyl)-piperidin-4-yloxy]-benzoyl}-piperidin-4-yl)-1,4-dihydro-benzo[d][1,3]oxazin-2-one | CHEMBL303487
TypeSmall organic molecule
Emp. Form.C33H38N4O6
Mol. Mass.586.678
SMILESCOc1cc(OC2CCN(Cc3c[n+]([O-])ccc3C)CC2)ccc1C(=O)N1CCC(CC1)N1C(=O)OCc2ccccc12