Reaction Details
TargetP2X purinoceptor 1
LigandBDBM50064800
Substrate/Competitorn/a
Meas. Tech.ChEMBL_162329 (CHEMBL856215)
IC50 42500±n/a nM
Citation Jacobson, KAKim, YCWildman, SSMohanram, AHarden, TKBoyer, JLKing, BFBurnstock, G A pyridoxine cyclic phosphate and its 6-azoaryl derivative selectively potentiate and antagonize activation of P2X1 receptors. J Med Chem41:2201-6 (1998) 
 
P2X purinoceptor 1
Name:P2X purinoceptor 1
Type:Enzyme Catalytic Domain
Mol. Mass.:44969.95
Organism:RAT
Description:Purinergic, P2X1 0 RAT::P47824
Residue:399
BDBM50064800
NameBDBM50064800
Synonyms:2-(4-Formyl-5-hydroxy-6-methyl-3-phosphonooxymethyl-pyridin-2-ylazo)-benzene-1,4-disulfonic acid isoPPADS | pyridoxal-alpha5-phosphate-6-azophenyl-2',5'-disulfonic acid
TypeSmall organic molecule
Emp. Form.C14H14N3O12PS2
Mol. Mass.511.378
SMILESCc1nc(N=Nc2cc(ccc2S(O)(=O)=O)S(O)(=O)=O)c(COP(O)(O)=O)c(C=O)c1O