Reaction Details
TargetGag-Pol polyprotein [489-587]
LigandBDBM167
Substrate/Competitorn/a
Meas. Tech.ChEMBL_157733 (CHEMBL765171)
Ki 0.049±n/a nM
Citation De Lucca, GVKim, UTLiang, JCordova, BKlabe, RMGarber, SBacheler, LTLam, GNWright, MRLogue, KAErickson-Viitanen, SKo, SSTrainor, GL Nonsymmetric P2/P2' cyclic urea HIV protease inhibitors. Structure-activity relationship, bioavailability, and resistance profile of monoindazole-substituted P2 analogues. J Med Chem41:2411-23 (1998) 
 
Gag-Pol polyprotein [489-587]
Name:Gag-Pol polyprotein [489-587]
Type:Enzyme Subunit
Mol. Mass.:10781.16
Organism:Human immunodeficiency virus type 1
Description:P04585[489-587]
Residue:99
BDBM167
NameBDBM167
Synonyms:3-{[(4R,5S,6S,7R)-4,7-dibenzyl-5,6-dihydroxy-3-(1H-indazol-5-ylmethyl)-2-oxo-1,3-diazepan-1-yl]methyl}benzoic acid Cyclic Urea
Typen/a
Emp. Form.C35H34N4O5
Mol. Mass.590.6683
SMILESO[C@@H]1[C@@H](O)[C@@H](Cc2ccccc2)N(Cc2ccc3[nH]ncc3c2)C(=O)N(Cc2cccc(c2)C(O)=O)[C@@H]1Cc1ccccc1