Reaction Details
TargetGag-Pol polyprotein [489-587]
LigandBDBM153
Substrate/Competitorn/a
Meas. Tech.ChEMBL_157733 (CHEMBL765171)
Ki 0.31±n/a nM
Citation De Lucca, GVKim, UTLiang, JCordova, BKlabe, RMGarber, SBacheler, LTLam, GNWright, MRLogue, KAErickson-Viitanen, SKo, SSTrainor, GL Nonsymmetric P2/P2' cyclic urea HIV protease inhibitors. Structure-activity relationship, bioavailability, and resistance profile of monoindazole-substituted P2 analogues. J Med Chem41:2411-23 (1998) 
 
Gag-Pol polyprotein [489-587]
Name:Gag-Pol polyprotein [489-587]
Type:Enzyme Subunit
Mol. Mass.:10781.16
Organism:Human immunodeficiency virus type 1
Description:P04585[489-587]
Residue:99
BDBM153
NameBDBM153
Synonyms:(4R,5S,6S,7R)-4,7-dibenzyl-5,6-dihydroxy-1,3-bis(naphthalen-2-ylmethyl)-1,3-diazepan-2-one XK263
Typen/a
Emp. Form.C41H38N2O3
Mol. Mass.606.752
SMILESO[C@@H]1[C@@H](O)[C@@H](Cc2ccccc2)N(Cc2ccc3ccccc3c2)C(=O)N(Cc2ccc3ccccc3c2)[C@@H]1Cc1ccccc1