Reaction Details
TargetGag-Pol polyprotein [489-587]
LigandBDBM50065091
Substrate/Competitorn/a
Meas. Tech.ChEMBL_157733 (CHEMBL765171)
Ki 0.036±n/a nM
Citation De Lucca, GVKim, UTLiang, JCordova, BKlabe, RMGarber, SBacheler, LTLam, GNWright, MRLogue, KAErickson-Viitanen, SKo, SSTrainor, GL Nonsymmetric P2/P2' cyclic urea HIV protease inhibitors. Structure-activity relationship, bioavailability, and resistance profile of monoindazole-substituted P2 analogues. J Med Chem41:2411-23 (1998) 
 
Gag-Pol polyprotein [489-587]
Name:Gag-Pol polyprotein [489-587]
Type:Enzyme Subunit
Mol. Mass.:10781.16
Organism:Human immunodeficiency virus type 1
Description:P04585[489-587]
Residue:99
BDBM50065091
NameBDBM50065091
Synonyms:(4R,5S,6S,7R)-1-(3-Acetyl-benzyl)-4,7-dibenzyl-5,6-dihydroxy-3-(1H-indazol-5-ylmethyl)-[1,3]diazepan-2-one | CHEMBL312672
TypeSmall organic molecule
Emp. Form.C36H36N4O4
Mol. Mass.588.6954
SMILESCC(=O)c1cccc(CN2[C@H](Cc3ccccc3)[C@H](O)[C@@H](O)[C@@H](Cc3ccccc3)N(Cc3ccc4[nH]ncc4c3)C2=O)c1