Reaction Details
TargetAcetylcholinesterase
LigandBDBM8964
Substrate/Competitorn/a
Meas. Tech.ChEMBL_1842236 (CHEMBL4342663)
IC50 0.660000±n/a nM
Citation Mishra, PKumar, APanda, G Anti-cholinesterase hybrids as multi-target-directed ligands against Alzheimer's disease (1998-2018). Bioorg Med Chem27:895-930 (2019) 
 
Acetylcholinesterase
Name:Acetylcholinesterase
Type:Enzyme
Mol. Mass.:68193.62
Organism:Rattus norvegicus (rat)
Description:P37136
Residue:614
BDBM8964
NameBDBM8964
Synonyms:CHEMBL75274 N-[8-(1,2,3,4-tetrahydroacridin-9-ylamino)octyl]-1,2,3,4-tetrahydroacridin-9-amine Tacrine-Based Inhibitor 2g
TypeSmall organic molecule
Emp. Form.C34H42N4
Mol. Mass.506.7241
SMILESC(CCCCNc1c2CCCCc2nc2ccccc12)CCCNc1c2CCCCc2nc2ccccc12