Reaction Details
TargetCarboxylic ester hydrolase
LigandBDBM8964
Substrate/Competitorn/a
Meas. Tech.ChEMBL_1842237 (CHEMBL4342664)
IC50 340±n/a nM
Citation Mishra, PKumar, APanda, G Anti-cholinesterase hybrids as multi-target-directed ligands against Alzheimer's disease (1998-2018). Bioorg Med Chem27:895-930 (2019) 
 
Carboxylic ester hydrolase
Name:Carboxylic ester hydrolase
Type:Enzyme
Mol. Mass.:67776.22
Organism:Rattus norvegicus (rat)
Description:n/a
Residue:597
BDBM8964
NameBDBM8964
Synonyms:CHEMBL75274 N-[8-(1,2,3,4-tetrahydroacridin-9-ylamino)octyl]-1,2,3,4-tetrahydroacridin-9-amine Tacrine-Based Inhibitor 2g
TypeSmall organic molecule
Emp. Form.C34H42N4
Mol. Mass.506.7241
SMILESC(CCCCNc1c2CCCCc2nc2ccccc12)CCCNc1c2CCCCc2nc2ccccc12