Reaction Details
TargetSigma non-opioid intracellular receptor 1
LigandBDBM50065145
Substrate/Competitorn/a
Meas. Tech.ChEMBL_200969 (CHEMBL802057)
Ki 41.8±n/a nM
Citation John, CSLim, BBVilner, BJGeyer, BCBowen, WD Substituted halogenated arylsulfonamides: a new class of sigma receptor binding tumor imaging agents. J Med Chem41:2445-50 (1998) 
 
Sigma non-opioid intracellular receptor 1
Name:Sigma non-opioid intracellular receptor 1
Type:Enzyme Catalytic Domain
Mol. Mass.:25124.85
Organism:Homo sapiens (Human)
Description:Q99720
Residue:223
BDBM50065145
NameBDBM50065145
Synonyms:3-Iodo-4-methoxy-N-(2-piperidin-1-yl-ethyl)-benzenesulfonamide | CHEMBL82081
TypeSmall organic molecule
Emp. Form.C14H21IN2O3S
Mol. Mass.424.298
SMILESCOc1ccc(cc1I)S(=O)(=O)NCCN1CCCCC1