Reaction Details
TargetVascular endothelial growth factor receptor 1
LigandBDBM50065290
Substrate/Competitorn/a
Meas. Tech.ChEMBL_214499 (CHEMBL818398)
IC50 2500±n/a nM
Citation Sun, LTran, NTang, FApp, HHirth, PMcMahon, GTang, C Synthesis and biological evaluations of 3-substituted indolin-2-ones: a novel class of tyrosine kinase inhibitors that exhibit selectivity toward particular receptor tyrosine kinases. J Med Chem41:2588-603 (1998) 
 
Vascular endothelial growth factor receptor 1
Name:Vascular endothelial growth factor receptor 1
Type:PROTEIN
Mol. Mass.:149906.69
Organism:Mus musculus
Description:ChEMBL_820931
Residue:1333
BDBM50065290
NameBDBM50065290
Synonyms:(Z)-4-(4-((4-methyl-2-oxoindolin-3-ylidene)methyl)phenyl)piperazine-1-carbaldehyde 4-{4-[4-Methyl-2-oxo-1,2-dihydro-indol-(3Z)-ylidenemethyl]-phenyl}-piperazine-1-carbaldehyde | CHEMBL89040
TypeSmall organic molecule
Emp. Form.C21H21N3O2
Mol. Mass.347.4103
SMILESCc1cccc2NC(=O)\C(=C/c3ccc(cc3)N3CCN(CC3)C=O)c12