Reaction Details
TargetPlatelet-derived growth factor receptor beta
LigandBDBM50065306
Substrate/Competitorn/a
Meas. Tech.ChEMBL_158520 (CHEMBL768947)
IC50 5100±n/a nM
Citation Sun, LTran, NTang, FApp, HHirth, PMcMahon, GTang, C Synthesis and biological evaluations of 3-substituted indolin-2-ones: a novel class of tyrosine kinase inhibitors that exhibit selectivity toward particular receptor tyrosine kinases. J Med Chem41:2588-603 (1998) 
 
Platelet-derived growth factor receptor beta
Name:Platelet-derived growth factor receptor beta
Type:Enzyme
Mol. Mass.:123922.25
Organism:Homo sapiens (Human)
Description:P09619
Residue:1106
BDBM50065306
NameBDBM50065306
Synonyms:3-[4-(1-formylpiperazin-4-yl)benzylidenyl]-2-indolinone CHEMBL315546 | SU-4984
TypeSmall organic molecule
Emp. Form.C20H19N3O2
Mol. Mass.333.3838
SMILESO=CN1CCN(CC1)c1ccc(\C=C2/C(=O)Nc3ccccc23)cc1