Reaction Details
TargetInsulin-like growth factor 1 receptor
LigandBDBM50065292
Substrate/Competitorn/a
Meas. Tech.ChEMBL_90281 (CHEMBL697346)
IC50>100000±n/a nM
Citation Sun, LTran, NTang, FApp, HHirth, PMcMahon, GTang, C Synthesis and biological evaluations of 3-substituted indolin-2-ones: a novel class of tyrosine kinase inhibitors that exhibit selectivity toward particular receptor tyrosine kinases. J Med Chem41:2588-603 (1998) 
 
Insulin-like growth factor 1 receptor
Name:Insulin-like growth factor 1 receptor
Type:Protein
Mol. Mass.:154776.79
Organism:Homo sapiens (Human)
Description:P08069
Residue:1367
BDBM50065292
NameBDBM50065292
Synonyms:(Z)-3-(3,5-Dimethyl-1H-pyrrol-2-ylmethylene)-5-methyl-1,3-dihydro-indol-2-one 3-[1-(3,5-Dimethyl-1H-pyrrol-2-yl)-meth-(Z)-ylidene]-5-methyl-1,3-dihydro-indol-2-one | CHEMBL89483
TypeSmall organic molecule
Emp. Form.C16H16N2O
Mol. Mass.252.311
SMILESCc1cc(C)c(\C=C2/C(=O)Nc3ccc(C)cc23)[nH]1