Reaction Details
TargetEpidermal growth factor receptor
LigandBDBM50065275
Substrate/Competitorn/a
Meas. Tech.ChEMBL_63615 (CHEMBL676159)
IC50 7900±n/a nM
Citation Sun, LTran, NTang, FApp, HHirth, PMcMahon, GTang, C Synthesis and biological evaluations of 3-substituted indolin-2-ones: a novel class of tyrosine kinase inhibitors that exhibit selectivity toward particular receptor tyrosine kinases. J Med Chem41:2588-603 (1998) 
 
Epidermal growth factor receptor
Name:Epidermal growth factor receptor
Type:Receptor Kinase Domain
Mol. Mass.:134279.59
Organism:Homo sapiens (Human)
Description:P00533
Residue:1210
BDBM50065275
NameBDBM50065275
Synonyms:3-(3,5-di-tert-butyl-4-hydroxybenzylidene)indolin-2-one CHEMBL89505
TypeSmall organic molecule
Emp. Form.C23H27NO2
Mol. Mass.349.466
SMILESCC(C)(C)c1cc(\C=C2/C(=O)Nc3ccccc23)cc(c1O)C(C)(C)C