Reaction Details
TargetVascular endothelial growth factor receptor 1
LigandBDBM50065280
Substrate/Competitorn/a
Meas. Tech.ChEMBL_214499 (CHEMBL818398)
IC50 2500±n/a nM
Citation Sun, LTran, NTang, FApp, HHirth, PMcMahon, GTang, C Synthesis and biological evaluations of 3-substituted indolin-2-ones: a novel class of tyrosine kinase inhibitors that exhibit selectivity toward particular receptor tyrosine kinases. J Med Chem41:2588-603 (1998) 
 
Vascular endothelial growth factor receptor 1
Name:Vascular endothelial growth factor receptor 1
Type:PROTEIN
Mol. Mass.:149906.69
Organism:Mus musculus
Description:ChEMBL_820931
Residue:1333
BDBM50065280
NameBDBM50065280
Synonyms:3-[1-(4-Morpholin-4-yl-phenyl)-meth-(Z)-ylidene]-1,3-dihydro-indol-2-one | CHEMBL86480
TypeSmall organic molecule
Emp. Form.C19H18N2O2
Mol. Mass.306.3584
SMILESO=C1Nc2ccccc2\C1=C\c1ccc(cc1)N1CCOCC1