Reaction Details
TargetVascular endothelial growth factor receptor 1
LigandBDBM50065310
Substrate/Competitorn/a
Meas. Tech.ChEMBL_214499 (CHEMBL818398)
IC50>10000±n/a nM
Citation Sun, LTran, NTang, FApp, HHirth, PMcMahon, GTang, C Synthesis and biological evaluations of 3-substituted indolin-2-ones: a novel class of tyrosine kinase inhibitors that exhibit selectivity toward particular receptor tyrosine kinases. J Med Chem41:2588-603 (1998) 
 
Vascular endothelial growth factor receptor 1
Name:Vascular endothelial growth factor receptor 1
Type:PROTEIN
Mol. Mass.:149906.69
Organism:Mus musculus
Description:ChEMBL_820931
Residue:1333
BDBM50065310
NameBDBM50065310
Synonyms:5-Bromo-3-(4-morpholin-4-yl-benzylidene)-1,3-dihydro-indol-2-one CHEMBL87080
TypeSmall organic molecule
Emp. Form.C19H17BrN2O2
Mol. Mass.385.254
SMILESBrc1ccc2NC(=O)\C(=C/c3ccc(cc3)N3CCOCC3)c2c1