Reaction Details
TargetPlatelet-derived growth factor receptor beta
LigandBDBM50065297
Substrate/Competitorn/a
Meas. Tech.ChEMBL_158520 (CHEMBL768947)
IC50 24200±n/a nM
Citation Sun, LTran, NTang, FApp, HHirth, PMcMahon, GTang, C Synthesis and biological evaluations of 3-substituted indolin-2-ones: a novel class of tyrosine kinase inhibitors that exhibit selectivity toward particular receptor tyrosine kinases. J Med Chem41:2588-603 (1998) 
 
Platelet-derived growth factor receptor beta
Name:Platelet-derived growth factor receptor beta
Type:Enzyme
Mol. Mass.:123922.25
Organism:Homo sapiens (Human)
Description:P09619
Residue:1106
BDBM50065297
NameBDBM50065297
Synonyms:3-(4-Isopropyl-benzylidene)-1,3-dihydro-indol-2-one CHEMBL48760
TypeSmall organic molecule
Emp. Form.C18H17NO
Mol. Mass.263.3337
SMILESCC(C)c1ccc(\C=C2\C(=O)Nc3ccccc23)cc1