Reaction Details
TargetReceptor tyrosine-protein kinase erbB-2
LigandBDBM50065314
Substrate/Competitorn/a
Meas. Tech.ChEMBL_78751 (CHEMBL686676)
IC50>100000±n/a nM
Citation Sun, LTran, NTang, FApp, HHirth, PMcMahon, GTang, C Synthesis and biological evaluations of 3-substituted indolin-2-ones: a novel class of tyrosine kinase inhibitors that exhibit selectivity toward particular receptor tyrosine kinases. J Med Chem41:2588-603 (1998) 
 
Receptor tyrosine-protein kinase erbB-2
Name:Receptor tyrosine-protein kinase erbB-2
Type:n/a
Mol. Mass.:137894.47
Organism:Homo sapiens (Human)
Description:P04626
Residue:1255
BDBM50065314
NameBDBM50065314
Synonyms:3-[1-(4-Pyrrolidin-1-yl-phenyl)-meth-(Z)-ylidene]-1,3-dihydro-indol-2-one | CHEMBL314217
TypeSmall organic molecule
Emp. Form.C19H18N2O
Mol. Mass.290.359
SMILESO=C1Nc2ccccc2\C1=C\c1ccc(cc1)N1CCCC1