Reaction Details
TargetVascular endothelial growth factor receptor 1
LigandBDBM50065288
Substrate/Competitorn/a
Meas. Tech.ChEMBL_214499 (CHEMBL818398)
IC50 1000±n/a nM
Citation Sun, LTran, NTang, FApp, HHirth, PMcMahon, GTang, C Synthesis and biological evaluations of 3-substituted indolin-2-ones: a novel class of tyrosine kinase inhibitors that exhibit selectivity toward particular receptor tyrosine kinases. J Med Chem41:2588-603 (1998) 
 
Vascular endothelial growth factor receptor 1
Name:Vascular endothelial growth factor receptor 1
Type:PROTEIN
Mol. Mass.:149906.69
Organism:Mus musculus
Description:ChEMBL_820931
Residue:1333
BDBM50065288
NameBDBM50065288
Synonyms:3-(3,5-Dimethyl-1H-pyrrol-2-ylmethylene)-4-methyl-1,3-dihydro-indol-2-one CHEMBL330321
TypeSmall organic molecule
Emp. Form.C16H16N2O
Mol. Mass.252.311
SMILESCc1cc(C)c(\C=C2/C(=O)Nc3cccc(C)c23)[nH]1