Reaction Details
TargetPlatelet-derived growth factor receptor beta
LigandBDBM50065311
Substrate/Competitorn/a
Meas. Tech.ChEMBL_158520 (CHEMBL768947)
IC50>100000±n/a nM
Citation Sun, LTran, NTang, FApp, HHirth, PMcMahon, GTang, C Synthesis and biological evaluations of 3-substituted indolin-2-ones: a novel class of tyrosine kinase inhibitors that exhibit selectivity toward particular receptor tyrosine kinases. J Med Chem41:2588-603 (1998) 
 
Platelet-derived growth factor receptor beta
Name:Platelet-derived growth factor receptor beta
Type:Enzyme
Mol. Mass.:123922.25
Organism:Homo sapiens (Human)
Description:P09619
Residue:1106
BDBM50065311
NameBDBM50065311
Synonyms:3-[1-(3,4-Dimethyl-1H-pyrrol-2-yl)-meth-(Z)-ylidene]-1,3-dihydro-indol-2-one | CHEMBL316020
TypeSmall organic molecule
Emp. Form.C15H14N2O
Mol. Mass.238.2845
SMILESCc1c[nH]c(\C=C2/C(=O)Nc3ccccc23)c1C