Reaction Details
TargetReceptor tyrosine-protein kinase erbB-2
LigandBDBM50065297
Substrate/Competitorn/a
Meas. Tech.ChEMBL_78751 (CHEMBL686676)
IC50 16900±n/a nM
Citation Sun, LTran, NTang, FApp, HHirth, PMcMahon, GTang, C Synthesis and biological evaluations of 3-substituted indolin-2-ones: a novel class of tyrosine kinase inhibitors that exhibit selectivity toward particular receptor tyrosine kinases. J Med Chem41:2588-603 (1998) 
 
Receptor tyrosine-protein kinase erbB-2
Name:Receptor tyrosine-protein kinase erbB-2
Type:n/a
Mol. Mass.:137894.47
Organism:Homo sapiens (Human)
Description:P04626
Residue:1255
BDBM50065297
NameBDBM50065297
Synonyms:3-(4-Isopropyl-benzylidene)-1,3-dihydro-indol-2-one CHEMBL48760
TypeSmall organic molecule
Emp. Form.C18H17NO
Mol. Mass.263.3337
SMILESCC(C)c1ccc(\C=C2\C(=O)Nc3ccccc23)cc1