Reaction Details
TargetEpidermal growth factor receptor
LigandBDBM50065317
Substrate/Competitorn/a
Meas. Tech.ChEMBL_63615 (CHEMBL676159)
IC50>100000±n/a nM
Citation Sun, LTran, NTang, FApp, HHirth, PMcMahon, GTang, C Synthesis and biological evaluations of 3-substituted indolin-2-ones: a novel class of tyrosine kinase inhibitors that exhibit selectivity toward particular receptor tyrosine kinases. J Med Chem41:2588-603 (1998) 
 
Epidermal growth factor receptor
Name:Epidermal growth factor receptor
Type:Receptor Kinase Domain
Mol. Mass.:134279.59
Organism:Homo sapiens (Human)
Description:P00533
Residue:1210
BDBM50065317
NameBDBM50065317
Synonyms:5-Chloro-3-(1H-pyrrol-2-ylmethylene)-1,3-dihydro-indol-2-one CHEMBL431025
TypeSmall organic molecule
Emp. Form.C13H9ClN2O
Mol. Mass.244.676
SMILESClc1ccc2NC(=O)\C(=C/c3ccc[nH]3)c2c1