Reaction Details
TargetNitric oxide synthase, endothelial
LigandBDBM50225106
Substrate/Competitorn/a
Meas. Tech.ChEMBL_65140 (CHEMBL677474)
IC50 1200±n/a nM
Citation Cowart, MKowaluk, EADaanen, JFKohlhaas, KLAlexander, KMWagenaar, FLKerwin, JF Nitroaromatic amino acids as inhibitors of neuronal nitric oxide synthase. J Med Chem41:2636-42 (1998) 
 
Nitric oxide synthase, endothelial
Name:Nitric oxide synthase, endothelial
Type:Enzyme
Mol. Mass.:133292.26
Organism:Bos taurus (bovine)
Description:Recombinant eNOS overexpressed in E. coli was used in enzyme assays.
Residue:1205
BDBM50225106
NameBDBM50225106
Synonyms:(2S)-2-amino-5-{[(E)-amino(nitroimino)methyl]amino}pentanoic acid (2S)-2-amino-5-{[(E)-imino(nitroamino)methyl]amino}pentanoic acid (S)-2-Amino-5-(N'-nitro-guanidino)-pentanoic acid CHEMBL227744 N-nitro-L-arginine Ngamma-nitro-L-arginine | Nomega-nitro-L-arginine
TypeSmall organic molecule
Emp. Form.C6H13N5O4
Mol. Mass.219.1985
SMILESN[C@@H](CCCNC(N)=N[N+]([O-])=O)C(O)=O