Reaction Details
TargetAdenosine receptor A3
LigandBDBM50065755
Substrate/Competitorn/a
Meas. Tech.ChEMBL_31839 (CHEMBL641516)
Ki 6.71±n/a nM
Citation Kim, YCde Zwart, MChang, LMoro, Svon Frijtag Drabbe Künzel, JKMelman, NIJzerman, APJacobson, KA Derivatives of the triazoloquinazoline adenosine antagonist (CGS 15943) having high potency at the human A2B and A3 receptor subtypes. J Med Chem41:2835-45 (1998) 
 
Adenosine receptor A3
Name:Adenosine receptor A3
Type:G Protein-Coupled Receptor (GPCR)
Mol. Mass.:36197.32
Organism:Homo sapiens (Human)
Description:P0DMS8
Residue:318
BDBM50065755
NameBDBM50065755
Synonyms:CHEMBL319539 | [2-(9-Chloro-2-furan-2-yl-[1,2,4]triazolo[1,5-c]quinazolin-5-ylcarbamoyl)-ethyl]-carbamic acid tert-butyl ester
TypeSmall organic molecule
Emp. Form.C21H21ClN6O4
Mol. Mass.456.882
SMILESCC(C)(C)OC(=O)NCCC(=O)Nc1nc2ccc(Cl)cc2c2nc(nn12)-c1ccco1