Reaction Details
TargetAdenosine receptor A2a
LigandBDBM50053936
Substrate/Competitorn/a
Meas. Tech.ChEMBL_30000 (CHEMBL643011)
Ki 1.38±n/a nM
Citation Kim, YCde Zwart, MChang, LMoro, Svon Frijtag Drabbe Künzel, JKMelman, NIJzerman, APJacobson, KA Derivatives of the triazoloquinazoline adenosine antagonist (CGS 15943) having high potency at the human A2B and A3 receptor subtypes. J Med Chem41:2835-45 (1998) 
 
Adenosine receptor A2a
Name:Adenosine receptor A2a
Type:G Protein-Coupled Receptor (GPCR)
Mol. Mass.:45015.65
Organism:Rattus norvegicus (rat)
Description:Rat A2A receptors expressed in CHO cells.
Residue:410
BDBM50053936
NameBDBM50053936
Synonyms:4-Amino-N-(9-chloro-2-furan-2-yl-[1,2,4]triazolo[1,5-c]quinazolin-5-yl)-butyramide | CHEMBL95811
TypeSmall organic molecule
Emp. Form.C17H15ClN6O2
Mol. Mass.370.793
SMILESNCCCC(=O)Nc1nc2ccc(Cl)cc2c2nc(nn12)-c1ccco1